Reaction Details
TargetHistone-lysine N-methyltransferase EHMT1
LigandBDBM50051117
Substrate/Competitorn/a
Meas. Tech.ChEMBL_1450367 (CHEMBL3378204)
IC50>100000±n/a nM
Citation Ma, AYu, WLi, FBleich, RMHerold, JMButler, KVNorris, JLKorboukh, VTripathy, AJanzen, WPArrowsmith, CHFrye, SVVedadi, MBrown, PJJin, J Discovery of a selective, substrate-competitive inhibitor of the lysine methyltransferase SETD8. J Med Chem57:6822-33 (2014) 
 
Histone-lysine N-methyltransferase EHMT1
Name:Histone-lysine N-methyltransferase EHMT1
Type:PROTEIN
Mol. Mass.:141443.67
Organism:Homo sapiens (Human)
Description:ChEMBL_1450367
Residue:1298
BDBM50051117
NameBDBM50051117
Synonyms:CHEMBL3318285
TypeSmall organic molecule
Emp. Form.C23H35N5O2
Mol. Mass.413.5563
SMILESCOc1cc2nc(nc(NCCCCCN3CCCC3)c2cc1OC)N1CCCC1