Reaction Details
TargetHistone-lysine N-methyltransferase SUV39H2
LigandBDBM50051117
Substrate/Competitorn/a
Meas. Tech.ChEMBL_1450368 (CHEMBL3378205)
IC50>100000±n/a nM
Citation Ma, AYu, WLi, FBleich, RMHerold, JMButler, KVNorris, JLKorboukh, VTripathy, AJanzen, WPArrowsmith, CHFrye, SVVedadi, MBrown, PJJin, J Discovery of a selective, substrate-competitive inhibitor of the lysine methyltransferase SETD8. J Med Chem57:6822-33 (2014) 
 
Histone-lysine N-methyltransferase SUV39H2
Name:Histone-lysine N-methyltransferase SUV39H2
Type:Enzyme
Mol. Mass.:46692.47
Organism:Homo sapiens (Human)
Description:Q9H5I1
Residue:410
BDBM50051117
NameBDBM50051117
Synonyms:CHEMBL3318285
TypeSmall organic molecule
Emp. Form.C23H35N5O2
Mol. Mass.413.5563
SMILESCOc1cc2nc(nc(NCCCCCN3CCCC3)c2cc1OC)N1CCCC1