Reaction Details
TargetProtein arginine N-methyltransferase 1 [11-371]
LigandBDBM50051117
Substrate/Competitorn/a
Meas. Tech.ChEMBL_1450372 (CHEMBL3378209)
IC50>100000±n/a nM
Citation Ma, AYu, WLi, FBleich, RMHerold, JMButler, KVNorris, JLKorboukh, VTripathy, AJanzen, WPArrowsmith, CHFrye, SVVedadi, MBrown, PJJin, J Discovery of a selective, substrate-competitive inhibitor of the lysine methyltransferase SETD8. J Med Chem57:6822-33 (2014) 
 
Protein arginine N-methyltransferase 1 [11-371]
Name:Protein arginine N-methyltransferase 1 [11-371]
Type:Protein
Mol. Mass.:41506.52
Organism:Homo sapiens (Human)
Description:Q99873[11-371]
Residue:361
BDBM50051117
NameBDBM50051117
Synonyms:CHEMBL3318285
TypeSmall organic molecule
Emp. Form.C23H35N5O2
Mol. Mass.413.5563
SMILESCOc1cc2nc(nc(NCCCCCN3CCCC3)c2cc1OC)N1CCCC1