Reaction Details
TargetfMet-Leu-Phe receptor
LigandBDBM50051705
Substrate/Competitorn/a
Meas. Tech.ChEMBL_1452136 (CHEMBL3365082)
Kd 280±n/a nM
Citation Hayashi, RKitajima, TMizuguchi, HFujimoto, MYamaguchi, AKoga, SKoga, YOsada, SKodama, H Development of potent antagonists for formyl peptide receptor 1 based on Boc-Phe-D-Leu-Phe-D-Leu-Phe-OH. Bioorg Med Chem22:3824-8 (2014) 
 
fMet-Leu-Phe receptor
Name:fMet-Leu-Phe receptor
Type:Enzyme Catalytic Domain
Mol. Mass.:38456.14
Organism:Homo sapiens (Human)
Description:gi_4503779
Residue:350
BDBM50051705
NameBDBM50051705
Synonyms:CHEMBL3311033
TypeSmall organic molecule
Emp. Form.C38H55N5O8
Mol. Mass.709.872
SMILESCC(C)C[C@@H](NC(=O)[C@H](C)NC(=O)[C@@H](CC(C)C)NC(=O)[C@H](Cc1ccccc1)NC(=O)OC(C)(C)C)C(=O)N[C@@H](Cc1ccccc1)C(O)=O