Reaction Details
TargetfMet-Leu-Phe receptor
LigandBDBM50051690
Substrate/Competitorn/a
Meas. Tech.ChEMBL_1452137 (CHEMBL3365083)
IC50 420±n/a nM
Citation Hayashi, RKitajima, TMizuguchi, HFujimoto, MYamaguchi, AKoga, SKoga, YOsada, SKodama, H Development of potent antagonists for formyl peptide receptor 1 based on Boc-Phe-D-Leu-Phe-D-Leu-Phe-OH. Bioorg Med Chem22:3824-8 (2014) 
 
fMet-Leu-Phe receptor
Name:fMet-Leu-Phe receptor
Type:Enzyme Catalytic Domain
Mol. Mass.:38456.14
Organism:Homo sapiens (Human)
Description:gi_4503779
Residue:350
BDBM50051690
NameBDBM50051690
Synonyms:CHEMBL3311137
TypeSmall organic molecule
Emp. Form.C51H63N5O9
Mol. Mass.890.074
SMILESCC(C)C[C@@H](NC(=O)[C@H](Cc1ccccc1)NC(=O)[C@@H](CC(C)C)NC(=O)[C@H](Cc1ccc(cc1)C(=O)c1ccccc1)NC(=O)OC(C)(C)C)C(=O)N[C@@H](Cc1ccccc1)C(O)=O