Reaction Details
TargetIndoleamine 2,3-dioxygenase 1
LigandBDBM31773
Substrate/Competitorn/a
Meas. Tech.ChEMBL_1452147 (CHEMBL3365093)
IC50 8100±n/a nM
Citation Röhrig, UFMajjigapu, SRChambon, MBron, SPilotte, LColau, DVan den Eynde, BJTurcatti, GVogel, PZoete, VMichielin, O Detailed analysis and follow-up studies of a high-throughput screening for indoleamine 2,3-dioxygenase 1 (IDO1) inhibitors. Eur J Med Chem84:284-301 (2014) 
 
Indoleamine 2,3-dioxygenase 1
Name:Indoleamine 2,3-dioxygenase 1
Type:Enzyme
Mol. Mass.:45330.80
Organism:Homo sapiens (Human)
Description:P14902
Residue:403
BDBM31773
NameBDBM31773
Synonyms:ECONAZOLE Gyno-pevaryl cid_68589
TypeSmall organic molecule
Emp. Form.C18H15Cl3N2O
Mol. Mass.381.684
SMILESClc1ccc(COC(Cn2ccnc2)c2ccc(Cl)cc2Cl)cc1