Reaction Details
TargetIndoleamine 2,3-dioxygenase 1
LigandBDBM31768
Substrate/Competitorn/a
Meas. Tech.ChEMBL_1452148 (CHEMBL3365094)
IC50 25000±n/a nM
Citation Röhrig, UFMajjigapu, SRChambon, MBron, SPilotte, LColau, DVan den Eynde, BJTurcatti, GVogel, PZoete, VMichielin, O Detailed analysis and follow-up studies of a high-throughput screening for indoleamine 2,3-dioxygenase 1 (IDO1) inhibitors. Eur J Med Chem84:284-301 (2014) 
 
Indoleamine 2,3-dioxygenase 1
Name:Indoleamine 2,3-dioxygenase 1
Type:Enzyme
Mol. Mass.:45330.80
Organism:Homo sapiens (Human)
Description:P14902
Residue:403
BDBM31768
NameBDBM31768
Synonyms:CHEMBL295698 Nizoral | Panfungol
TypeSmall organic molecule
Emp. Form.C26H28Cl2N4O4
Mol. Mass.531.431
SMILESCC(=O)N1CCN(CC1)c1ccc(OC[C@@H]2CO[C@](Cn3ccnc3)(O2)c2ccc(Cl)cc2Cl)cc1