Reaction Details
TargetCytochrome P450 2C9
LigandBDBM50051939
Substrate/Competitorn/a
Meas. Tech.ChEMBL_1453046 (CHEMBL3362128)
IC50 40±n/a nM
Citation Wang, HCJagtap, ADChang, PTLiu, JRLiu, CPTseng, HWChen, GSChern, JW Bioisosteric replacement of an acylureido moiety attached to an indolin-2-one scaffold with a malonamido or a 2/4-pyridinoylamido moiety produces a selectively potent Aurora-B inhibitor. Eur J Med Chem84:312-34 (2014) 
 
Cytochrome P450 2C9
Name:Cytochrome P450 2C9
Type:Enzyme
Mol. Mass.:55636.33
Organism:Homo sapiens (Human)
Description:P11712
Residue:490
BDBM50051939
NameBDBM50051939
Synonyms:CHEMBL3322590
TypeSmall organic molecule
Emp. Form.C25H17FN4O3
Mol. Mass.440.4259
SMILESFc1ccccc1-c1c[nH]cc(C(=O)Nc2ccc3\C(=C\c4ccc[nH]4)C(=O)Nc3c2)c1=O