Reaction Details
TargetAurora kinase B
LigandBDBM50052031
Substrate/Competitorn/a
Meas. Tech.ChEMBL_1453020 (CHEMBL3362102)
IC50 128±n/a nM
Citation Wang, HCJagtap, ADChang, PTLiu, JRLiu, CPTseng, HWChen, GSChern, JW Bioisosteric replacement of an acylureido moiety attached to an indolin-2-one scaffold with a malonamido or a 2/4-pyridinoylamido moiety produces a selectively potent Aurora-B inhibitor. Eur J Med Chem84:312-34 (2014) 
 
Aurora kinase B
Name:Aurora kinase B
Type:Protein
Mol. Mass.:39327.72
Organism:Homo sapiens (Human)
Description:Q96GD4
Residue:344
BDBM50052031
NameBDBM50052031
Synonyms:CHEMBL3322583
TypeSmall organic molecule
Emp. Form.C25H17FN4O3
Mol. Mass.440.4259
SMILESFc1ccc(cc1)-c1c[nH]cc(C(=O)Nc2ccc3\C(=C\c4ccc[nH]4)C(=O)Nc3c2)c1=O