Reaction Details
TargetPlatelet-derived growth factor receptor alpha
LigandBDBM50051957
Substrate/Competitorn/a
Meas. Tech.ChEMBL_1453023 (CHEMBL3362105)
IC50<1.000000±n/a nM
Citation Wang, HCJagtap, ADChang, PTLiu, JRLiu, CPTseng, HWChen, GSChern, JW Bioisosteric replacement of an acylureido moiety attached to an indolin-2-one scaffold with a malonamido or a 2/4-pyridinoylamido moiety produces a selectively potent Aurora-B inhibitor. Eur J Med Chem84:312-34 (2014) 
 
Platelet-derived growth factor receptor alpha
Name:Platelet-derived growth factor receptor alpha
Type:Protein
Mol. Mass.:122633.38
Organism:Homo sapiens (Human)
Description:P16234
Residue:1089
BDBM50051957
NameBDBM50051957
Synonyms:CHEMBL3322566
TypeSmall organic molecule
Emp. Form.C32H36N6O5
Mol. Mass.584.6654
SMILESCOc1ccc(NC(=O)CC(=O)Nc2ccc3\C(=C\c4[nH]c(C)c(C(=O)NCCN5CCCC5)c4C)C(=O)Nc3c2)cc1