Reaction Details
TargetPlatelet-derived growth factor receptor beta
LigandBDBM50051943
Substrate/Competitorn/a
Meas. Tech.ChEMBL_1453025 (CHEMBL3362107)
IC50 177±n/a nM
Citation Wang, HCJagtap, ADChang, PTLiu, JRLiu, CPTseng, HWChen, GSChern, JW Bioisosteric replacement of an acylureido moiety attached to an indolin-2-one scaffold with a malonamido or a 2/4-pyridinoylamido moiety produces a selectively potent Aurora-B inhibitor. Eur J Med Chem84:312-34 (2014) 
 
Platelet-derived growth factor receptor beta
Name:Platelet-derived growth factor receptor beta
Type:Enzyme
Mol. Mass.:123922.25
Organism:Homo sapiens (Human)
Description:P09619
Residue:1106
BDBM50051943
NameBDBM50051943
Synonyms:CHEMBL3322564
TypeSmall organic molecule
Emp. Form.C23H20N4O4
Mol. Mass.416.4293
SMILESCOc1ccc(NC(=O)CC(=O)Nc2ccc3\C(=C\c4ccc[nH]4)C(=O)Nc3c2)cc1