Reaction Details
TargetPlatelet-derived growth factor receptor beta
LigandBDBM50051941
Substrate/Competitorn/a
Meas. Tech.ChEMBL_1453025 (CHEMBL3362107)
IC50 8.1±n/a nM
Citation Wang, HCJagtap, ADChang, PTLiu, JRLiu, CPTseng, HWChen, GSChern, JW Bioisosteric replacement of an acylureido moiety attached to an indolin-2-one scaffold with a malonamido or a 2/4-pyridinoylamido moiety produces a selectively potent Aurora-B inhibitor. Eur J Med Chem84:312-34 (2014) 
 
Platelet-derived growth factor receptor beta
Name:Platelet-derived growth factor receptor beta
Type:Enzyme
Mol. Mass.:123922.25
Organism:Homo sapiens (Human)
Description:P09619
Residue:1106
BDBM50051941
NameBDBM50051941
Synonyms:CHEMBL3322565
TypeSmall organic molecule
Emp. Form.C26H24N4O6
Mol. Mass.488.492
SMILESCOc1ccc(NC(=O)CC(=O)Nc2ccc3\C(=C\c4[nH]c(C)c(C(O)=O)c4C)C(=O)Nc3c2)cc1