Reaction Details
TargetCasein kinase II subunit alpha
LigandBDBM11323
Substrate/Competitorn/a
Meas. Tech.ChEMBL_1455649 (CHEMBL3365678)
Ki 400±n/a nM
Citation Borowiecki, PWawro, AMWinska, PWielechowska, MBretner, M Synthesis of novel chiral TBBt derivatives with hydroxyl moiety. Studies on inhibition of human protein kinase CK2a and cytotoxicity properties. Eur J Med Chem84:364-74 (2014) 
 
Casein kinase II subunit alpha
Name:Casein kinase II subunit alpha
Type:Enzyme
Mol. Mass.:45151.12
Organism:Homo sapiens (Human)
Description:P68400
Residue:391
BDBM11323
NameBDBM11323
Synonyms:4,5,6,7-tetrabromo-1H-1,2,3-benzotriazole CHEMBL177820 | TBB
TypeSmall organic molecule
Emp. Form.C6HBr4N3
Mol. Mass.434.708
SMILESBrc1c(Br)c(Br)c2[nH]nnc2c1Br