Reaction Details
TargetCasein kinase II subunit alpha
LigandBDBM50156670
Substrate/Competitorn/a
Meas. Tech.ChEMBL_1455649 (CHEMBL3365678)
Ki 40±n/a nM
Citation Borowiecki, PWawro, AMWinska, PWielechowska, MBretner, M Synthesis of novel chiral TBBt derivatives with hydroxyl moiety. Studies on inhibition of human protein kinase CK2a and cytotoxicity properties. Eur J Med Chem84:364-74 (2014) 
 
Casein kinase II subunit alpha
Name:Casein kinase II subunit alpha
Type:Enzyme
Mol. Mass.:45151.12
Organism:Homo sapiens (Human)
Description:P68400
Residue:391
BDBM50156670
NameBDBM50156670
Synonyms:2-(dimethylamino)-4,5,6,7-tetrabromo-1H-benzimidazole CHEMBL376505
TypeSmall organic molecule
Emp. Form.C9H7Br4N3
Mol. Mass.476.788
SMILESCN(C)c1nc2c(Br)c(Br)c(Br)c(Br)c2[nH]1