Reaction Details
TargetAcetylcholinesterase
LigandBDBM50052212
Substrate/Competitorn/a
Meas. Tech.ChEMBL_1455650 (CHEMBL3365679)
IC50 4.9±n/a nM
Citation Akrami, HMirjalili, BFKhoobi, MNadri, HMoradi, ASakhteman, AEmami, SForoumadi, AShafiee, A Indolinone-based acetylcholinesterase inhibitors: synthesis, biological activity and molecular modeling. Eur J Med Chem84:375-81 (2014) 
 
Acetylcholinesterase
Name:Acetylcholinesterase
Type:Enzyme
Mol. Mass.:71812.79
Organism:Electrophorus electricus (Electric eel)
Description:n/a
Residue:633
BDBM50052212
NameBDBM50052212
Synonyms:CHEMBL3318400
TypeSmall organic molecule
Emp. Form.C21H16BrClN2O
Mol. Mass.427.722
SMILES[Br-].Clc1cccc(C[n+]2ccc(\C=C3\C(=O)Nc4ccccc34)cc2)c1