Reaction Details
TargetAcetylcholinesterase
LigandBDBM50052221
Substrate/Competitorn/a
Meas. Tech.ChEMBL_1455650 (CHEMBL3365679)
IC50 744±n/a nM
Citation Akrami, HMirjalili, BFKhoobi, MNadri, HMoradi, ASakhteman, AEmami, SForoumadi, AShafiee, A Indolinone-based acetylcholinesterase inhibitors: synthesis, biological activity and molecular modeling. Eur J Med Chem84:375-81 (2014) 
 
Acetylcholinesterase
Name:Acetylcholinesterase
Type:Enzyme
Mol. Mass.:71812.79
Organism:Electrophorus electricus (Electric eel)
Description:n/a
Residue:633
BDBM50052221
NameBDBM50052221
Synonyms:CHEMBL3318397
TypeSmall organic molecule
Emp. Form.C21H16ClN3O3
Mol. Mass.393.823
SMILES[Cl-].[O-][N+](=O)c1ccc(C[n+]2ccc(\C=C3\C(=O)Nc4ccccc34)cc2)cc1