Reaction Details
TargetCholinesterase
LigandBDBM50052209
Substrate/Competitorn/a
Meas. Tech.ChEMBL_1455651 (CHEMBL3365680)
IC50 1600±n/a nM
Citation Akrami, HMirjalili, BFKhoobi, MNadri, HMoradi, ASakhteman, AEmami, SForoumadi, AShafiee, A Indolinone-based acetylcholinesterase inhibitors: synthesis, biological activity and molecular modeling. Eur J Med Chem84:375-81 (2014) 
 
Cholinesterase
Name:Cholinesterase
Type:Enzyme
Mol. Mass.:65643.35
Organism:Equus caballus (Horse)
Description:P81908
Residue:574
BDBM50052209
NameBDBM50052209
Synonyms:CHEMBL3318395
TypeSmall organic molecule
Emp. Form.C21H16BrN3O3
Mol. Mass.438.274
SMILES[Br-].[O-][N+](=O)c1ccccc1C[n+]1ccc(\C=C2\C(=O)Nc3ccccc23)cc1