Reaction Details
TargetCytochrome P450 2C9
LigandBDBM50052254
Substrate/Competitorn/a
Meas. Tech.ChEMBL_1456622 (CHEMBL3370222)
IC50>5000±n/a nM
Citation Dragovich, PSFauber, BPBoggs, JChen, JCorson, LBDing, CZEigenbrot, CGe, HGiannetti, AMHunsaker, TLabadie, SLi, CLiu, YLiu, YMa, SMalek, SPeterson, DPitts, KEPurkey, HERobarge, KSalphati, LSideris, SUltsch, MVanderPorten, EWang, JWei, BXu, QYen, IYue, QZhang, HZhang, XZhou, A Identification of substituted 3-hydroxy-2-mercaptocyclohex-2-enones as potent inhibitors of human lactate dehydrogenase. Bioorg Med Chem Lett24:3764-71 (2014) 
 
Cytochrome P450 2C9
Name:Cytochrome P450 2C9
Type:Enzyme
Mol. Mass.:55636.33
Organism:Homo sapiens (Human)
Description:P11712
Residue:490
BDBM50052254
NameBDBM50052254
Synonyms:2',6'-dichloro-4-((2-chlorophenyl)thio)-5-hydroxy-1,6-dihydro-[1,1'-biphenyl]-3(2H)-one (3) | CHEMBL3318469
TypeSmall organic molecule
Emp. Form.C18H13Cl3O2S
Mol. Mass.399.719
SMILESOC1=C(Sc2ccccc2Cl)C(=O)CC(C1)c1c(Cl)cccc1Cl