Reaction Details
TargetFatty-acid amide hydrolase 1 [30-579]
LigandBDBM50052789
Substrate/Competitorn/a
Meas. Tech.ChEMBL_1456649 (CHEMBL3370249)
Ki 0.100000±n/a nM
Citation Otrubova, KSrinivasan, VBoger, DL Discovery libraries targeting the major enzyme classes: the serine hydrolases. Bioorg Med Chem Lett24:3807-13 (2014) 
 
Fatty-acid amide hydrolase 1 [30-579]
Name:Fatty-acid amide hydrolase 1 [30-579]
Type:Single-pass membrane protein; homodimer
Mol. Mass.:60474.00
Organism:Rattus norvegicus (rat)
Description:P97612 (aa 30-579)
Residue:550
BDBM50052789
NameBDBM50052789
Synonyms:CHEMBL3318616
TypeSmall organic molecule
Emp. Form.C22H21N5O2
Mol. Mass.387.4344
SMILESO=C(N1CCN(Cc2ccc(Oc3ccccc3)cc2)CC1)n1cc(cn1)C#N