Reaction Details
TargetDeoxyribonuclease-1
LigandBDBM50052802
Substrate/Competitorn/a
Meas. Tech.ChEMBL_1457550 (CHEMBL3368168)
IC50 350±n/a nM
Citation Kolarevic, AYancheva, DKocic, GSmelcerovic, A Deoxyribonuclease inhibitors. Eur J Med Chem88:101-11 (2014) 
 
Deoxyribonuclease-1
Name:Deoxyribonuclease-1
Type:PROTEIN
Mol. Mass.:31422.78
Organism:Homo sapiens (Human)
Description:ChEMBL_109543
Residue:282
BDBM50052802
NameBDBM50052802
Synonyms:CHEBI:77181 Crystal violet (15) | Hexamethyl pararosaniline
TypeSmall organic molecule
Emp. Form.C25H30N3
Mol. Mass.372.5253
SMILES[#6]-[#7](-[#6])-c1ccc(cc1)-[#6](=[#6]-1\[#6]=[#6]/[#6](/[#6]=[#6]-1)=[#7+](\[#6])-[#6])\c1ccc(cc1)-[#7](-[#6])-[#6]