Reaction Details
TargetSerine/threonine-protein kinase Chk1
LigandBDBM50053260
Substrate/Competitorn/a
Meas. Tech.ChEMBL_1458470 (CHEMBL3370356)
IC50 16±n/a nM
Citation Song, PPeng, PHan, MCao, XMa, XLiu, TZhou, YHu, Y Design, synthesis and biological evaluation of thienopyridinones as Chk1 inhibitors. Bioorg Med Chem22:4882-92 (2014) 
 
Serine/threonine-protein kinase Chk1
Name:Serine/threonine-protein kinase Chk1
Type:Enzyme Catalytic Domain
Mol. Mass.:54443.02
Organism:Homo sapiens (Human)
Description:gi_166295192
Residue:476
BDBM50053260
NameBDBM50053260
Synonyms:CHEMBL3330132
TypeSmall organic molecule
Emp. Form.C19H19N5OS
Mol. Mass.365.452
SMILESO=c1[nH]c2sccc2c(NC2CCCNC2)c1-c1nc2ccccc2[nH]1