Reaction Details
TargetAurora kinase A
LigandBDBM50053256
Substrate/Competitorn/a
Meas. Tech.ChEMBL_1458473 (CHEMBL3370359)
IC50>10000±n/a nM
Citation Song, PPeng, PHan, MCao, XMa, XLiu, TZhou, YHu, Y Design, synthesis and biological evaluation of thienopyridinones as Chk1 inhibitors. Bioorg Med Chem22:4882-92 (2014) 
 
Aurora kinase A
Name:Aurora kinase A
Type:Serine/threonine-protein kinase
Mol. Mass.:45830.98
Organism:Homo sapiens (Human)
Description:O14965
Residue:403
BDBM50053256
NameBDBM50053256
Synonyms:CHEMBL3330136
TypeSmall organic molecule
Emp. Form.C21H21N5OS
Mol. Mass.391.489
SMILESO=c1[nH]c2sccc2c(NC2CN3CCC2CC3)c1-c1nc2ccccc2[nH]1