Reaction Details
TargetAurora kinase A
LigandBDBM50053263
Substrate/Competitorn/a
Meas. Tech.ChEMBL_1458484 (CHEMBL3370370)
IC50 690±n/a nM
Citation Song, DPark, YYoon, JAman, WHah, JMRyu, JS Click approach to the discovery of 1,2,3-triazolylsalicylamides as potent Aurora kinase inhibitors. Bioorg Med Chem22:4855-66 (2014) 
 
Aurora kinase A
Name:Aurora kinase A
Type:Serine/threonine-protein kinase
Mol. Mass.:45830.98
Organism:Homo sapiens (Human)
Description:O14965
Residue:403
BDBM50053263
NameBDBM50053263
Synonyms:CHEMBL3322937
TypeSmall organic molecule
Emp. Form.C24H13F9N4O2
Mol. Mass.560.3712
SMILESOc1ccc(cc1C(=O)Nc1cccc(c1)C(F)(F)F)-n1cc(nn1)-c1cc(cc(c1)C(F)(F)F)C(F)(F)F