Reaction Details
TargetAurora kinase B
LigandBDBM50053261
Substrate/Competitorn/a
Meas. Tech.ChEMBL_1458485 (CHEMBL3370371)
IC50 47500±n/a nM
Citation Song, DPark, YYoon, JAman, WHah, JMRyu, JS Click approach to the discovery of 1,2,3-triazolylsalicylamides as potent Aurora kinase inhibitors. Bioorg Med Chem22:4855-66 (2014) 
 
Aurora kinase B
Name:Aurora kinase B
Type:Protein
Mol. Mass.:39327.72
Organism:Homo sapiens (Human)
Description:Q96GD4
Residue:344
BDBM50053261
NameBDBM50053261
Synonyms:CHEMBL3322933
TypeSmall organic molecule
Emp. Form.C23H19ClN4O4
Mol. Mass.450.874
SMILESCOc1cc(OC)cc(c1)-c1cn(nn1)-c1ccc(O)c(c1)C(=O)Nc1cccc(Cl)c1