Reaction Details
TargetDual specificity protein kinase TTK
LigandBDBM50053309
Substrate/Competitorn/a
Meas. Tech.ChEMBL_1458487 (CHEMBL3370373)
IC50 12000±n/a nM
Citation Laufer, RNg, GLiu, YPatel, NKEdwards, LGLang, YLi, SWFeher, MAwrey, DELeung, GBeletskaya, IPlotnikova, OMason, JMHodgson, RWei, XMao, GLuo, XHuang, PGreen, EKiarash, RLin, DCHarris-Brandts, MBan, FNadeem, VMak, TWPan, GJQiu, WChirgadze, NYPauls, HW Discovery of inhibitors of the mitotic kinase TTK based on N-(3-(3-sulfamoylphenyl)-1H-indazol-5-yl)-acetamides and carboxamides. Bioorg Med Chem22:4968-97 (2014) 
 
Dual specificity protein kinase TTK
Name:Dual specificity protein kinase TTK
Type:Protein
Mol. Mass.:97086.79
Organism:Homo sapiens (Human)
Description:P33981
Residue:857
BDBM50053309
NameBDBM50053309
Synonyms:CHEMBL315708
TypeSmall organic molecule
Emp. Form.C13H10N2
Mol. Mass.194.2319
SMILESc1ccc(cc1)-c1[nH]nc2ccccc12