Reaction Details
TargetDual specificity protein kinase TTK
LigandBDBM50433903
Substrate/Competitorn/a
Meas. Tech.ChEMBL_1458487 (CHEMBL3370373)
IC50 10.0±n/a nM
Citation Laufer, RNg, GLiu, YPatel, NKEdwards, LGLang, YLi, SWFeher, MAwrey, DELeung, GBeletskaya, IPlotnikova, OMason, JMHodgson, RWei, XMao, GLuo, XHuang, PGreen, EKiarash, RLin, DCHarris-Brandts, MBan, FNadeem, VMak, TWPan, GJQiu, WChirgadze, NYPauls, HW Discovery of inhibitors of the mitotic kinase TTK based on N-(3-(3-sulfamoylphenyl)-1H-indazol-5-yl)-acetamides and carboxamides. Bioorg Med Chem22:4968-97 (2014) 
 
Dual specificity protein kinase TTK
Name:Dual specificity protein kinase TTK
Type:Protein
Mol. Mass.:97086.79
Organism:Homo sapiens (Human)
Description:P33981
Residue:857
BDBM50433903
NameBDBM50433903
Synonyms:CHEMBL2380586
TypeSmall organic molecule
Emp. Form.C23H26N6O2S
Mol. Mass.450.557
SMILESCn1cc(cn1)-c1cc2[nH]nc(-c3cccc(c3)S(N)(=O)=O)c2cc1NC1CCCCC1