Reaction Details
TargetEukaryotic elongation factor 2 kinase
LigandBDBM50053577
Substrate/Competitorn/a
Meas. Tech.ChEMBL_1446963 (CHEMBL3373720)
IC50 1000±n/a nM
Citation Edupuganti, RWang, QTavares, CDChitjian, CABachman, JLRen, PAnslyn, EVDalby, KN Synthesis and biological evaluation of pyrido[2,3-d]pyrimidine-2,4-dione derivatives as eEF-2K inhibitors. Bioorg Med Chem22:4910-6 (2014) 
 
Eukaryotic elongation factor 2 kinase
Name:Eukaryotic elongation factor 2 kinase
Type:Protein
Mol. Mass.:82116.99
Organism:Homo sapiens (Human)
Description:n/a
Residue:725
BDBM50053577
NameBDBM50053577
Synonyms:CHEMBL3326370
TypeSmall organic molecule
Emp. Form.C12H15N5O3
Mol. Mass.277.2792
SMILESCCn1c2nc(N)c(cc2c(=O)n(CC)c1=O)C(N)=O