Reaction Details
TargetSerine/threonine-protein kinase pim-1
LigandBDBM50053688
Substrate/Competitorn/a
Meas. Tech.ChEMBL_1446971 (CHEMBL3373728)
Ki 0.071000±n/a nM
Citation Abdel-Magid, AF Pim kinase inhibitors for the treatment of cancer and possibly more. ACS Med Chem Lett5:730-1 (2014) 
 
Serine/threonine-protein kinase pim-1
Name:Serine/threonine-protein kinase pim-1
Type:Protein
Mol. Mass.:35681.82
Organism:Homo sapiens (Human)
Description:P11309
Residue:313
BDBM50053688
NameBDBM50053688
Synonyms:CHEMBL3318856 | US9328106, 380
TypeSmall organic molecule
Emp. Form.C24H26F3N5O3S
Mol. Mass.521.555
SMILESCn1ncc(NC(=O)c2csc(n2)-c2c(F)cc(cc2F)[C@H]2CCCO2)c1[C@@H]1CC[C@@H](N)[C@H](F)CO1