Reaction Details
TargetPotassium voltage-gated channel subfamily H member 2
LigandBDBM50054507
Substrate/Competitorn/a
Meas. Tech.ChEMBL_1447890 (CHEMBL3378637)
IC50 2520±n/a nM
Citation He, SLai, ZYe, ZDobbelaar, PHShah, SKTruong, QDu, WGuo, LLiu, JJian, TQi, HBakshi, RKHong, QDellureficio, JReibarkh, MSamuel, KReddy, VBMitelman, STong, SXChicchi, GGTsao, KLTrusca, DWu, MShao, QTrujillo, MEFernandez, GNelson, DBunting, PKerr, JFitzgerald, PMorissette, PVolksdorf, SEiermann, GJLi, CZhang, BHoward, ADZhou, YPNargund, RPHagmann, WK Investigation of Cardiovascular Effects of Tetrahydro-ß-carboline sstr3 antagonists. ACS Med Chem Lett5:748-53 (2014) 
 
Potassium voltage-gated channel subfamily H member 2
Name:Potassium voltage-gated channel subfamily H member 2
Type:Multi-pass membrane protein
Mol. Mass.:126672.65
Organism:Homo sapiens (Human)
Description:Q12809
Residue:1159
BDBM50054507
NameBDBM50054507
Synonyms:CHEMBL3323077
TypeSmall organic molecule
Emp. Form.C32H28FN7O2
Mol. Mass.561.6088
SMILESCCOC(=O)c1cncc(c1)[C@]1(N[C@H](Cc2c1[nH]c1ccccc21)c1nc(c[nH]1)-c1ccc(F)cc1)c1cnn(C)c1