Reaction Details
TargetSomatostatin receptor type 3
LigandBDBM50054462
Substrate/Competitorn/a
Meas. Tech.ChEMBL_1447895 (CHEMBL3378642)
IC50 0.350000±n/a nM
Citation He, SLai, ZYe, ZDobbelaar, PHShah, SKTruong, QDu, WGuo, LLiu, JJian, TQi, HBakshi, RKHong, QDellureficio, JReibarkh, MSamuel, KReddy, VBMitelman, STong, SXChicchi, GGTsao, KLTrusca, DWu, MShao, QTrujillo, MEFernandez, GNelson, DBunting, PKerr, JFitzgerald, PMorissette, PVolksdorf, SEiermann, GJLi, CZhang, BHoward, ADZhou, YPNargund, RPHagmann, WK Investigation of Cardiovascular Effects of Tetrahydro-ß-carboline sstr3 antagonists. ACS Med Chem Lett5:748-53 (2014) 
 
Somatostatin receptor type 3
Name:Somatostatin receptor type 3
Type:Enzyme Catalytic Domain
Mol. Mass.:47225.49
Organism:MOUSE
Description:SOMATOSTATIN SST3 SSTR3 MOUSE::P30935
Residue:428
BDBM50054462
NameBDBM50054462
Synonyms:CHEMBL3323076
TypeSmall organic molecule
Emp. Form.C32H28FN7O2
Mol. Mass.561.6088
SMILESCCOC(=O)c1cncc(c1)[C@@]1(N[C@H](Cc2c1[nH]c1ccccc21)c1nc(c[nH]1)-c1ccc(F)cc1)c1cnn(C)c1