Reaction Details
TargetHexokinase-4
LigandBDBM50054054
Substrate/Competitorn/a
Meas. Tech.ChEMBL_1455572 (CHEMBL3364949)
IC50 42±n/a nM
Citation Hong, FTNorman, MHAshton, KSBartberger, MDChen, JChmait, SCupples, RFotsch, CJordan, SRLloyd, DJSivits, GTadesse, SHale, CSt Jean, DJ Small molecule disruptors of the glucokinase-glucokinase regulatory protein interaction: 4. Exploration of a novel binding pocket. J Med Chem57:5949-64 (2014) 
 
Hexokinase-4
Name:Hexokinase-4
Type:Enzyme
Mol. Mass.:52175.81
Organism:Homo sapiens (Human)
Description:P35557
Residue:465
BDBM50054054
NameBDBM50054054
Synonyms:CHEMBL3319547
TypeSmall organic molecule
Emp. Form.C24H23F6N5O5S2
Mol. Mass.639.59
SMILESCS(=O)(=O)c1ccc(cc1)-c1cc(cnc1N1CCN(CC1)S(=O)(=O)c1ccc(N)nc1)C(O)(C(F)(F)F)C(F)(F)F