Reaction Details
TargetKinesin-like protein KIF11
LigandBDBM50054136
Substrate/Competitorn/a
Meas. Tech.ChEMBL_1457426 (CHEMBL3367369)
IC50 120±n/a nM
Citation Yamamoto, JAmishiro, NKato, KOhta, YIno, YAraki, MTsujita, TOkamoto, STakahashi, TKusaka, HAkinaga, SYamashita, YNakai, RMurakata, C Synthetic studies on mitotic kinesin Eg5 inhibitors: synthesis and structure-activity relationships of novel 2,4,5-substituted-1,3,4-thiadiazoline derivatives. Bioorg Med Chem Lett24:3961-3 (2014) 
 
Kinesin-like protein KIF11
Name:Kinesin-like protein KIF11
Type:PROTEIN
Mol. Mass.:119138.97
Organism:Homo sapiens (Human)
Description:ChEMBL_1457426
Residue:1056
BDBM50054136
NameBDBM50054136
Synonyms:CHEMBL3319302
TypeSmall organic molecule
Emp. Form.C21H32N4O4S2
Mol. Mass.468.633
SMILESCC(C)(C)C(=O)NC1=NN(C(=O)C(C)(C)C)C(CCNS(C)(=O)=O)(S1)c1ccccc1