Reaction Details
TargetKinesin-like protein KIF11
LigandBDBM50054192
Substrate/Competitorn/a
Meas. Tech.ChEMBL_1457426 (CHEMBL3367369)
IC50 110±n/a nM
Citation Yamamoto, JAmishiro, NKato, KOhta, YIno, YAraki, MTsujita, TOkamoto, STakahashi, TKusaka, HAkinaga, SYamashita, YNakai, RMurakata, C Synthetic studies on mitotic kinesin Eg5 inhibitors: synthesis and structure-activity relationships of novel 2,4,5-substituted-1,3,4-thiadiazoline derivatives. Bioorg Med Chem Lett24:3961-3 (2014) 
 
Kinesin-like protein KIF11
Name:Kinesin-like protein KIF11
Type:PROTEIN
Mol. Mass.:119138.97
Organism:Homo sapiens (Human)
Description:ChEMBL_1457426
Residue:1056
BDBM50054192
NameBDBM50054192
Synonyms:CHEMBL3319304
TypeSmall organic molecule
Emp. Form.C20H30N4O4S2
Mol. Mass.454.607
SMILESCC(C)C(=O)N1N=C(NC(=O)C(C)(C)C)SC1(CCNS(C)(=O)=O)c1ccccc1