Reaction Details
TargetDual specificity protein phosphatase 10
LigandBDBM50054344
Substrate/Competitorn/a
Meas. Tech.ChEMBL_1458330 (CHEMBL3369523)
IC50 2900±n/a nM
Citation Zeng, LFZhang, RYYu, ZHLi, SWu, LGunawan, AMLane, BSMali, RSLi, XChan, RJKapur, RWells, CDZhang, ZY Therapeutic potential of targeting the oncogenic SHP2 phosphatase. J Med Chem57:6594-609 (2014) 
 
Dual specificity protein phosphatase 10
Name:Dual specificity protein phosphatase 10
Type:Enzyme
Mol. Mass.:52649.12
Organism:Homo sapiens (Human)
Description:Q9Y6W6
Residue:482
BDBM50054344
NameBDBM50054344
Synonyms:CHEMBL3319356 US9844535, ID 11a-1 L97M74
TypeSmall organic molecule
Emp. Form.C28H20IN3O5S
Mol. Mass.637.445
SMILESCn1c(c(I)c2cc(C(O)=O)c(O)cc12)-c1cccc(NC(=O)C(=O)Nc2ccc(cc2)-c2ccsc2)c1