Reaction Details
TargetSodium-dependent serotonin transporter
LigandBDBM170453
Substrate/Competitorn/a
Meas. Tech.ChEMBL_1450413 (CHEMBL3379357)
IC50 4.9±n/a nM
Citation Liu, SZha, CNacro, KHu, MCui, WYang, YLBhatt, USambandam, AIsherwood, MYet, LHerr, MTEbeltoft, SHassler, CFleming, LPechulis, ADPayen-Fornicola, AHolman, NMilanowski, DCotterill, IMozhaev, VKhmelnitsky, YGuzzo, PRSargent, BJMolino, BFOlson, RKing, DLelas, SLi, YWJohnson, KMolski, TOrie, ANg, AHaskell, RClarke, WBertekap, RO'Connell, JLodge, NSinz, MAdams, SZaczek, RMacor, JE Design and synthesis of 4-heteroaryl 1,2,3,4-tetrahydroisoquinolines as triple reuptake inhibitors. ACS Med Chem Lett5:760-5 (2014) 
 
Sodium-dependent serotonin transporter
Name:Sodium-dependent serotonin transporter
Type:Multi-pass membrane protein
Mol. Mass.:70322.51
Organism:Homo sapiens (Human)
Description:P31645
Residue:630
BDBM170453
NameBDBM170453
Synonyms:US9085531, 100
TypeSmall organic molecule
Emp. Form.C22H24N2OS
Mol. Mass.364.504
SMILESCN1CC(c2ccc3sccc3c2)c2ccc(cc2C1)N1CCOCC1