Reaction Details
TargetSodium-dependent dopamine transporter
LigandBDBM170440
Substrate/Competitorn/a
Meas. Tech.ChEMBL_1450411 (CHEMBL3379355)
IC50 190±n/a nM
Citation Liu, SZha, CNacro, KHu, MCui, WYang, YLBhatt, USambandam, AIsherwood, MYet, LHerr, MTEbeltoft, SHassler, CFleming, LPechulis, ADPayen-Fornicola, AHolman, NMilanowski, DCotterill, IMozhaev, VKhmelnitsky, YGuzzo, PRSargent, BJMolino, BFOlson, RKing, DLelas, SLi, YWJohnson, KMolski, TOrie, ANg, AHaskell, RClarke, WBertekap, RO'Connell, JLodge, NSinz, MAdams, SZaczek, RMacor, JE Design and synthesis of 4-heteroaryl 1,2,3,4-tetrahydroisoquinolines as triple reuptake inhibitors. ACS Med Chem Lett5:760-5 (2014) 
 
Sodium-dependent dopamine transporter
Name:Sodium-dependent dopamine transporter
Type:Multi-pass membrane protein
Mol. Mass.:68497.11
Organism:Homo sapiens (Human)
Description:Q01959
Residue:620
BDBM170440
NameBDBM170440
Synonyms:US9085531, 40
TypeSmall organic molecule
Emp. Form.C18H17NS
Mol. Mass.279.399
SMILESCN1CC(c2ccc3sccc3c2)c2ccccc2C1