Reaction Details
TargetSodium-dependent serotonin transporter
LigandBDBM170454
Substrate/Competitorn/a
Meas. Tech.ChEMBL_1450410 (CHEMBL3378814)
IC50 4.4±n/a nM
Citation Liu, SZha, CNacro, KHu, MCui, WYang, YLBhatt, USambandam, AIsherwood, MYet, LHerr, MTEbeltoft, SHassler, CFleming, LPechulis, ADPayen-Fornicola, AHolman, NMilanowski, DCotterill, IMozhaev, VKhmelnitsky, YGuzzo, PRSargent, BJMolino, BFOlson, RKing, DLelas, SLi, YWJohnson, KMolski, TOrie, ANg, AHaskell, RClarke, WBertekap, RO'Connell, JLodge, NSinz, MAdams, SZaczek, RMacor, JE Design and synthesis of 4-heteroaryl 1,2,3,4-tetrahydroisoquinolines as triple reuptake inhibitors. ACS Med Chem Lett5:760-5 (2014) 
 
Sodium-dependent serotonin transporter
Name:Sodium-dependent serotonin transporter
Type:Multi-pass membrane protein
Mol. Mass.:70322.51
Organism:Homo sapiens (Human)
Description:P31645
Residue:630
BDBM170454
NameBDBM170454
Synonyms:US9085531, 102
TypeSmall organic molecule
Emp. Form.C21H24N2S
Mol. Mass.336.494
SMILESCN(C)Cc1ccc2C(CN(C)Cc2c1)c1ccc2sccc2c1