Reaction Details
TargetRenin
LigandBDBM50054639
Substrate/Competitorn/a
Meas. Tech.ChEMBL_1452195 (CHEMBL3365817)
IC50 5340±n/a nM
Citation Ehara, TIrie, OKosaka, TKanazawa, TBreitenstein, WGrosche, POstermann, NSuzuki, MKawakami, SKonishi, KHitomi, YToyao, AGunji, HCumin, FSchiering, NWagner, TRigel, DFWebb, RLMaibaum, JYokokawa, F Structure-based design of substituted piperidines as a new class of highly efficacious oral direct Renin inhibitors. ACS Med Chem Lett5:787-92 (2014) 
 
Renin
Name:Renin
Type:Enzyme
Mol. Mass.:45058.99
Organism:Homo sapiens (Human)
Description:n/a
Residue:406
BDBM50054639
NameBDBM50054639
Synonyms:CHEMBL3318929
TypeSmall organic molecule
Emp. Form.C27H44ClN3O3
Mol. Mass.494.11
SMILESCl.CCOC[C@@H](CC(C)C)NC(=O)[C@@H]1CNC[C@@H](C1)C(=O)N(C1CC1)c1ccc(cc1)C(C)C