Reaction Details
TargetCarbonic anhydrase 2
LigandBDBM50054646
Substrate/Competitorn/a
Meas. Tech.ChEMBL_1453079 (CHEMBL3362528)
Ki 6.1±n/a nM
Citation Pichake, JKharkar, PSCeruso, MSupuran, CTToraskar, MP Carbonic anhydrase inhibitors: design, synthesis, and biological evaluation of novel sulfonyl semicarbazide derivatives. ACS Med Chem Lett5:793-6 (2014) 
 
Carbonic anhydrase 2
Name:Carbonic anhydrase 2
Type:Enzyme
Mol. Mass.:29250.71
Organism:Homo sapiens (Human)
Description:P00918
Residue:260
BDBM50054646
NameBDBM50054646
Synonyms:CHEMBL3323209
TypeSmall organic molecule
Emp. Form.C14H16N4O5S2
Mol. Mass.384.431
SMILESCc1ccc(cc1)S(=O)(=O)NNC(=O)Nc1ccc(cc1)S(N)(=O)=O