Reaction Details
TargetCarbonic anhydrase 1
LigandBDBM50054647
Substrate/Competitorn/a
Meas. Tech.ChEMBL_1453078 (CHEMBL3362527)
Ki 49±n/a nM
Citation Pichake, JKharkar, PSCeruso, MSupuran, CTToraskar, MP Carbonic anhydrase inhibitors: design, synthesis, and biological evaluation of novel sulfonyl semicarbazide derivatives. ACS Med Chem Lett5:793-6 (2014) 
 
Carbonic anhydrase 1
Name:Carbonic anhydrase 1
Type:Enzyme
Mol. Mass.:28873.37
Organism:Homo sapiens (Human)
Description:P00915
Residue:261
BDBM50054647
NameBDBM50054647
Synonyms:CHEMBL3323208
TypeSmall organic molecule
Emp. Form.C13H13BrN4O5S2
Mol. Mass.449.3
SMILESNS(=O)(=O)c1ccc(NC(=O)NNS(=O)(=O)c2ccc(Br)cc2)cc1