Reaction Details
TargetCarbonic anhydrase 1
LigandBDBM50054650
Substrate/Competitorn/a
Meas. Tech.ChEMBL_1453078 (CHEMBL3362527)
Ki 41±n/a nM
Citation Pichake, JKharkar, PSCeruso, MSupuran, CTToraskar, MP Carbonic anhydrase inhibitors: design, synthesis, and biological evaluation of novel sulfonyl semicarbazide derivatives. ACS Med Chem Lett5:793-6 (2014) 
 
Carbonic anhydrase 1
Name:Carbonic anhydrase 1
Type:Enzyme
Mol. Mass.:28873.37
Organism:Homo sapiens (Human)
Description:P00915
Residue:261
BDBM50054650
NameBDBM50054650
Synonyms:CHEMBL3323205
TypeSmall organic molecule
Emp. Form.C13H14N4O5S2
Mol. Mass.370.404
SMILESNS(=O)(=O)c1ccc(NC(=O)NNS(=O)(=O)c2ccccc2)cc1