Reaction Details
TargetCarbonic anhydrase 12
LigandBDBM50054648
Substrate/Competitorn/a
Meas. Tech.ChEMBL_1453081 (CHEMBL3362530)
Ki 0.630000±n/a nM
Citation Pichake, JKharkar, PSCeruso, MSupuran, CTToraskar, MP Carbonic anhydrase inhibitors: design, synthesis, and biological evaluation of novel sulfonyl semicarbazide derivatives. ACS Med Chem Lett5:793-6 (2014) 
 
Carbonic anhydrase 12
Name:Carbonic anhydrase 12
Type:Enzyme
Mol. Mass.:39456.00
Organism:Homo sapiens (Human)
Description:Catalytic domain of human cloned isozyme was used in the assay
Residue:354
BDBM50054648
NameBDBM50054648
Synonyms:CHEMBL3323207
TypeSmall organic molecule
Emp. Form.C13H13ClN4O5S2
Mol. Mass.404.849
SMILESNS(=O)(=O)c1ccc(NC(=O)NNS(=O)(=O)c2ccc(Cl)cc2)cc1