Reaction Details
Target11-beta-hydroxysteroid dehydrogenase 1
LigandBDBM50054690
Substrate/Competitorn/a
Meas. Tech.ChEMBL_1453118 (CHEMBL3364416)
IC50 0.610000±n/a nM
Citation Li, JKennedy, LJWang, HLi, JJWalker, SJHong, ZO'Connor, SPNayeem, ACamac, DMMorin, PESheriff, SWang, MHarper, TGolla, RSeethala, RHarrity, TPonticiello, RPMorgan, NNTaylor, JRZebo, RGordon, DARobl, JA Optimization of 1,2,4-Triazolopyridines as Inhibitors of Human 11ß-Hydroxysteroid Dehydrogenase Type 1 (11ß-HSD-1). ACS Med Chem Lett5:803-8 (2014) 
 
11-beta-hydroxysteroid dehydrogenase 1
Name:11-beta-hydroxysteroid dehydrogenase 1
Type:Enzyme
Mol. Mass.:32409.16
Organism:Homo sapiens (Human)
Description:P28845
Residue:292
BDBM50054690
NameBDBM50054690
Synonyms:CHEMBL3318979
TypeSmall organic molecule
Emp. Form.C18H18ClN3
Mol. Mass.311.809
SMILESCC(C)c1cccn2c(nnc12)C1(CC1)c1ccc(Cl)cc1