Reaction Details
TargetPhosphatidylinositol 4,5-bisphosphate 3-kinase catalytic subunit gamma isoform
LigandBDBM50189764
Substrate/Competitorn/a
Meas. Tech.ChEMBL_1453986 (CHEMBL3366680)
IC50 80±n/a nM
Citation Taha, MOAl-Sha'er, MAKhanfar, MAAl-Nadaf, AH Discovery of nanomolar phosphoinositide 3-kinase gamma (PI3Kż) inhibitors using ligand-based modeling and virtual screening followed by in vitro analysis. Eur J Med Chem84:454-65 (2014) 
 
Phosphatidylinositol 4,5-bisphosphate 3-kinase catalytic subunit gamma isoform
Name:Phosphatidylinositol 4,5-bisphosphate 3-kinase catalytic subunit gamma isoform
Type:Enzyme Subunit
Mol. Mass.:126470.30
Organism:Homo sapiens (Human)
Description:P48736
Residue:1102
BDBM50189764
NameBDBM50189764
Synonyms:5-[5-(2-hydroxy-3-nitrophenyl)furan-2-ylmethylene]thiazolidine-2,4-dione | CHEMBL210991
TypeSmall organic molecule
Emp. Form.C14H8N2O6S
Mol. Mass.332.288
SMILESOc1c(cccc1[N+]([O-])=O)-c1ccc(\C=C2/SC(=O)NC2=O)o1