Reaction Details
TargetSimilar to alpha-tubulin isoform 1
LigandBDBM50424716
Substrate/Competitorn/a
Meas. Tech.ChEMBL_1454845 (CHEMBL3363844)
IC50>400000±n/a nM
Citation Porců, ESipos, ABasso, GHamel, EBai, RStempfer, VUdvardy, ABényei, ACSchmidhammer, HAntus, SViola, G Novel 9'-substituted-noscapines: synthesis with Suzuki cross-coupling, structure elucidation and biological evaluation. Eur J Med Chem84:476-90 (2014) 
 
Similar to alpha-tubulin isoform 1
Name:Similar to alpha-tubulin isoform 1
Synonyms:Similar to alpha-tubulin isoform 1
Type:PROTEIN
Mol. Mass.:10383.05
Organism:Bos taurus
Description:ChEMBL_104716
Residue:99
BDBM50424716
NameBDBM50424716
TypeSmall organic molecule
Emp. Form.C22H23NO7
Mol. Mass.413.4205
SMILESCOc1ccc2[C@H](OC(=O)c2c1OC)[C@@H]1N(C)CCc2cc3OCOc3c(OC)c12