Reaction Details
TargetKappa-type opioid receptor
LigandBDBM50055063
Substrate/Competitorn/a
Meas. Tech.ChEMBL_1447926 (CHEMBL3379229)
Ki 8.70±n/a nM
Citation Bourgeois, CWerfel, EGalla, FLehmkuhl, KTorres-Gómez, HSchepmann, DKögel, BChristoph, TStraßburger, WEnglberger, WSoeberdt, MHüwel, SGalla, HJWünsch, B Synthesis and pharmacological evaluation of 5-pyrrolidinylquinoxalines as a novel class of peripherally restricted¿-opioid receptor agonists. J Med Chem57:6845-60 (2014) 
 
Kappa-type opioid receptor
Name:Kappa-type opioid receptor
Type:G Protein-Coupled Receptor (GPCR)
Mol. Mass.:42744.99
Organism:Cavia porcellus (domestic guinea pig)
Description:P41144
Residue:380
BDBM50055063
NameBDBM50055063
Synonyms:CHEMBL3323510
TypeSmall organic molecule
Emp. Form.C20H27Cl2N3O2
Mol. Mass.412.353
SMILESOC1CCN(C1)C1CCCC2NCCN(C12)C(=O)Cc1ccc(Cl)c(Cl)c1