Reaction Details
TargetKappa-type opioid receptor
LigandBDBM50316622
Substrate/Competitorn/a
Meas. Tech.ChEMBL_1447926 (CHEMBL3379229)
Ki 0.310000±n/a nM
Citation Bourgeois, CWerfel, EGalla, FLehmkuhl, KTorres-Gómez, HSchepmann, DKögel, BChristoph, TStraßburger, WEnglberger, WSoeberdt, MHüwel, SGalla, HJWünsch, B Synthesis and pharmacological evaluation of 5-pyrrolidinylquinoxalines as a novel class of peripherally restricted¿-opioid receptor agonists. J Med Chem57:6845-60 (2014) 
 
Kappa-type opioid receptor
Name:Kappa-type opioid receptor
Type:G Protein-Coupled Receptor (GPCR)
Mol. Mass.:42744.99
Organism:Cavia porcellus (domestic guinea pig)
Description:P41144
Residue:380
BDBM50316622
NameBDBM50316622
Synonyms:(S)-methyl 4-(2-(3,4-dichlorophenyl)acetyl)-3-((S)-1-(pyrrolidin-1-yl)ethyl)piperazine-1-carboxylate | CHEMBL1094879
TypeSmall organic molecule
Emp. Form.C20H27Cl2N3O3
Mol. Mass.428.353
SMILESCOC(=O)N1CCN([C@@H](C1)[C@H](C)N1CCCC1)C(=O)Cc1ccc(Cl)c(Cl)c1