Reaction Details
TargetKappa-type opioid receptor
LigandBDBM50055062
Substrate/Competitorn/a
Meas. Tech.ChEMBL_1447928 (CHEMBL3379231)
Ki 28±n/a nM
Citation Bourgeois, CWerfel, EGalla, FLehmkuhl, KTorres-Gómez, HSchepmann, DKögel, BChristoph, TStraßburger, WEnglberger, WSoeberdt, MHüwel, SGalla, HJWünsch, B Synthesis and pharmacological evaluation of 5-pyrrolidinylquinoxalines as a novel class of peripherally restricted¿-opioid receptor agonists. J Med Chem57:6845-60 (2014) 
 
Kappa-type opioid receptor
Name:Kappa-type opioid receptor
Type:G Protein-Coupled Receptor (GPCR)
Mol. Mass.:42744.99
Organism:Cavia porcellus (domestic guinea pig)
Description:P41144
Residue:380
BDBM50055062
NameBDBM50055062
Synonyms:CHEMBL3323509
TypeSmall organic molecule
Emp. Form.C20H27Cl2N3O
Mol. Mass.396.354
SMILESClc1ccc(CC(=O)N2CCNC3CCCC(C23)N2CCCC2)cc1Cl