Reaction Details
TargetKappa-type opioid receptor
LigandBDBM50055068
Substrate/Competitorn/a
Meas. Tech.ChEMBL_1447928 (CHEMBL3379231)
Ki 24±n/a nM
Citation Bourgeois, CWerfel, EGalla, FLehmkuhl, KTorres-Gómez, HSchepmann, DKögel, BChristoph, TStraßburger, WEnglberger, WSoeberdt, MHüwel, SGalla, HJWünsch, B Synthesis and pharmacological evaluation of 5-pyrrolidinylquinoxalines as a novel class of peripherally restricted¿-opioid receptor agonists. J Med Chem57:6845-60 (2014) 
 
Kappa-type opioid receptor
Name:Kappa-type opioid receptor
Type:G Protein-Coupled Receptor (GPCR)
Mol. Mass.:42744.99
Organism:Cavia porcellus (domestic guinea pig)
Description:P41144
Residue:380
BDBM50055068
NameBDBM50055068
Synonyms:CHEMBL3323515
TypeSmall organic molecule
Emp. Form.C26H32Cl2N4O
Mol. Mass.487.464
SMILESClc1ccc(CC(=O)N2CCN(Cc3ccccn3)C3CCCC(C23)N2CCCC2)cc1Cl