Reaction Details
TargetKappa-type opioid receptor
LigandBDBM50055077
Substrate/Competitorn/a
Meas. Tech.ChEMBL_1447928 (CHEMBL3379231)
Ki 870±n/a nM
Citation Bourgeois, CWerfel, EGalla, FLehmkuhl, KTorres-Gómez, HSchepmann, DKögel, BChristoph, TStraßburger, WEnglberger, WSoeberdt, MHüwel, SGalla, HJWünsch, B Synthesis and pharmacological evaluation of 5-pyrrolidinylquinoxalines as a novel class of peripherally restricted¿-opioid receptor agonists. J Med Chem57:6845-60 (2014) 
 
Kappa-type opioid receptor
Name:Kappa-type opioid receptor
Type:G Protein-Coupled Receptor (GPCR)
Mol. Mass.:42744.99
Organism:Cavia porcellus (domestic guinea pig)
Description:P41144
Residue:380
BDBM50055077
NameBDBM50055077
Synonyms:CHEMBL3323525
TypeSmall organic molecule
Emp. Form.C23H29Cl2N3O5
Mol. Mass.498.399
SMILESOC1CCN(C1)C1CCCC2C1N(CCN2C(=O)CC(O)=O)C(=O)Cc1ccc(Cl)c(Cl)c1